{"text_format":"1","workbook":"xlsx","n_sheets":10,"sheets":["Poročilo o izvedenem tekmovanju","ePrijava in Navodila","U11","U13","U15","U11-PI","U13-PI","Pravilnik","sodniki","clanice"],"not_rendered":{"charts":0,"images":0,"macros":1,"external_links":0,"defined_names":1,"comments":0,"pivot_tables":0},"unopened":[],"bounds":{"document_bytes":16777216,"sheet_cells":100000,"rows_first":2000,"rows_last":500,"rows_between":2000,"halvings":0,"cell_chars":16384,"cell_head_chars":4096},"cells_cut":0,"cells_raw":0,"read":"whole","date_system":"1900"}

{"sheet":"Poročilo o izvedenem tekmovanju","index":0,"n_rows":100,"n_cols":10,"rows_kept":100,"cut":false,"hidden":false,"merged":[[0,1,0,10],[2,1,2,10],[7,2,7,3],[7,7,7,8],[29,2,29,8],[7,5,7,6],[9,7,9,9],[17,2,17,9],[21,2,21,9],[5,2,5,9],[12,2,12,9],[13,2,13,9],[14,2,14,9],[15,2,15,9],[16,2,16,9],[18,2,18,9],[20,2,20,9],[19,2,19,9],[44,2,44,3],[35,2,35,8],[42,2,42,4],[39,2,39,9],[36,2,36,8]]}
[null,"ZAPISNIK"]
[]
[null,"o izvedenem tekmovanju v streljanju s serijsko zračno puško in zračno pištolo v Pokalu prijateljstva SZS"]
[]
[]
[null,"Izvajalec (društvo): ","Izberite iz seznama"]
[]
[null,"Datum:",null,null,null,"Pričetek ob:"]
{"$rows_left_out":93}
{"sheet":"ePrijava in Navodila","index":1,"n_rows":34,"n_cols":26,"rows_kept":34,"cut":false,"hidden":false,"merged":[[0,3,0,9],[19,25,21,28],[4,25,17,28],[6,0,6,9],[6,11,6,12],[8,1,8,9],[8,11,8,12]]}
[null,null,null,"TEKMOVANJE:  POKAL PRIJATELJSTVA SZS"]
[null,null,null,null,null,"DATUM:"]
[null,null,null,null,null,"1. skupina"]
[null,null,null,null,null,"2.skupija"]
[null,null,null,null,null,"3.skupina",null,null,null,null,null,null,null,null,null,null,null,null,null,null,null,null,null,null,null,"OPOMNIK ZA VODENJE REZULTATOV V POKALU PRIJATELJSTVA. Vsi tekmovalci, ki bodo nastopili na tekmovanju morajo biti zabeleženi v tem seznamu, drugače jih ne morete prenesti v seznam za rezultate. Torej lahko se bo kopiralo iz ePrijave  ali pa se bodo ročno vpisali, kar pa odsvetujemo zaradi možnih napak in v tem primeru v skupnih rezultatih ne bo imel rezultata. Neregistriranega tekmovalca pa morate zabeležiti v seznam na koncu ter mu določiti začasno BIB številko, ki se prične s številko regije, kategorijo in zaporedno številko v seznamu (npr.2U1501, kjer pomeni 2-regija; U15-kategorija, 01-zaporedna številka v seznamu.  Kopiranje iz ePrijave (predhodno si pripravite seznam iz spleta, katerega lahko uporabite tudi za elektronske tarče in vodenje rezultatov). V ePrijavi na spletu označite vse celice in jih kopirajte v ta seznam v celico B13. Odznačite osenčeno funkcijo \"Prelomi besedilo\", da se vrstice poravnajo. Za tekmovalce, katere boste imeli na tekmovanju samo prenesete oz. vpišete BIB številke v zavihek ustrezne starostne kategorije v stolpec E. Za moške od vrstice 5, za ženska od vrstice 110. Tekmovalce društva, kateri nastopajo za ekipo društva pa evidentirate z vpisom BIB številke v stolpec R . Seznam prijavljenih lahko uporabite za SIUS vodenje, vendar se rezultati obvezno prepišejo na ta OBRAZEC EXCEL in SE POŠLJE NA MAIL :rezultatiszs@gmail.com"]
[null,null,null,null,null,"4.skupina"]
["ŠTARTNA LISTA",null,null,null,null,null,null,null,null,null,null,"TEKMA - STRELIŠČE"]
[]
{"$rows_left_out":27}
{"sheet":"U11","index":2,"n_rows":149,"n_cols":27,"rows_kept":149,"cut":false,"hidden":false,"merged":[[0,18,2,37],[104,0,108,0],[104,1,108,1],[104,2,105,12],[0,2,0,12],[1,0,3,0],[1,1,3,1],[1,2,1,12],[103,4,103,5]]}
[null,null,"POKAL PRIJATELJSTVA SERIJSKA ZRAČNA PUŠKA - NASLON",null,null,null,null,null,null,null,null,null,null,null,null,null,null,null,"Iz evidence in zavihka ePrijava in Navodila se za tekmovalca v seznam za rezultate v stolpec E vpiše BIB številka pri \"moških\" od vrstice 5 dalje, za \"ženske\"pa od vrstice 110 dalje. Po vpisu BIB bo preneslo vse podatke v ta seznam, kjer se nato vpisujejo rezultati. Vpiše se rezultat serije v K in L  ter nc*. Prav tako se za upoštevanje rezultata ekipno vpišejo samo BIB številke v stolpcu R za vse tri člane ekipe, ki je lahko mešana. Prenos ostalih podatkov je samodejen.  Posamezno se lahko razvrsti, ekipno ostane nerazvrščeno. Dokument mora imeti omogočen makro."]
["mesto",null,"U11 (mlajši dečki)"]
[]
[null,null,"Priimek in ime","Roj.skrita","BIB","Društvo, klub","1. ser","2. ser","3. ser","4. ser","1. ser","2. ser","skupno","nc*"]
[1,null,{"$f":"IF(E5=\"\",\"\",VLOOKUP(E5,'ePrijava in Navodila'!$B$13:$H$164,2,FALSE) & \" \" & VLOOKUP(E5,'ePrijava in Navodila'!$B$13:$H$164,3,FALSE))","v":""},{"$f":"IF(E5=\"\",\"\",VLOOKUP(E5,'ePrijava in Navodila'!$B$13:$H$164,5,FALSE))","v":""},null,{"$f":"IF(E5=\"\",\"\",VLOOKUP(E5,'ePrijava in Navodila'!$B$13:$H$164,7,FALSE))","v":""},null,null,null,null,null,null,{"$f":"SUM(G5:L5)","v":0},null,null,null,null,null,"EKIPNO: "]
[2,null,{"$f":"IF(E6=\"\",\"\",VLOOKUP(E6,'ePrijava in Navodila'!$B$13:$H$164,2,FALSE) & \" \" & VLOOKUP(E6,'ePrijava in Navodila'!$B$13:$H$164,3,FALSE))","v":""},{"$f":"IF(E6=\"\",\"\",VLOOKUP(E6,'ePrijava in Navodila'!$B$13:$H$164,5,FALSE))","v":""},null,{"$f":"IF(E6=\"\",\"\",VLOOKUP(E6,'ePrijava in Navodila'!$B$13:$H$164,7,FALSE))","v":""},null,null,null,null,null,null,0]
[3,null,{"$f":"IF(E7=\"\",\"\",VLOOKUP(E7,'ePrijava in Navodila'!$B$13:$H$164,2,FALSE) & \" \" & VLOOKUP(E7,'ePrijava in Navodila'!$B$13:$H$164,3,FALSE))","v":""},{"$f":"IF(E7=\"\",\"\",VLOOKUP(E7,'ePrijava in Navodila'!$B$13:$H$164,5,FALSE))","v":""},null,{"$f":"IF(E7=\"\",\"\",VLOOKUP(E7,'ePrijava in Navodila'!$B$13:$H$164,7,FALSE))","v":""},null,null,null,null,null,null,0,null,null,null,null,null,{"$f":"IF(R9=\"\",\"\",VLOOKUP(R9,'ePrijava in Navodila'!$B$13:$H$164,7,FALSE))","v":""}]
[4,null,{"$f":"IF(E8=\"\",\"\",VLOOKUP(E8,'ePrijava in Navodila'!$B$13:$H$164,2,FALSE) & \" \" & VLOOKUP(E8,'ePrijava in Navodila'!$B$13:$H$164,3,FALSE))","v":""},{"$f":"IF(E8=\"\",\"\",VLOOKUP(E8,'ePrijava in Navodila'!$B$13:$H$164,5,FALSE))","v":""},null,{"$f":"IF(E8=\"\",\"\",VLOOKUP(E8,'ePrijava in Navodila'!$B$13:$H$164,7,FALSE))","v":""},null,null,null,null,null,null,0,null,null,null,null,"BIB","Priimek in ime","1. ser","2. ser","3. ser","4. ser","1. ser","2. ser","skupno","nc*"]
{"$rows_left_out":142}
{"sheet":"U13","index":3,"n_rows":149,"n_cols":27,"rows_kept":149,"cut":false,"hidden":false,"merged":[[104,0,108,0],[104,1,108,1],[104,2,105,12],[0,2,0,12],[0,18,2,37],[1,0,3,0],[1,1,3,1],[1,2,1,12],[103,4,103,5]]}
[null,null,"POKAL PRIJATELJSTVA SERIJSKA ZRAČNA PUŠKA - NASLON",null,null,null,null,null,null,null,null,null,null,null,null,null,null,null,"Iz evidence in zavihka ePrijava in Navodila se za tekmovalca v seznam za rezultate v stolpec E vpiše BIB številka pri \"moških\" od vrstice 5 dalje, za \"ženske\"pa od vrstice 110 dalje. Po vpisu BIB bo preneslo vse podatke v ta seznam, kjer se nato vpisujejo rezultati. Vpiše se rezultat serije v K in L  ter nc*. Prav tako se za upoštevanje rezultata ekipno vpišejo samo BIB številke v stolpcu R za vse tri člane ekipe, ki je lahko mešana. Prenos ostalih podatkov je samodejen.  Posamezno se lahko razvrsti, ekipno ostane nerazvrščeno. Dokument mora imeti omogočen makro."]
["mesto",null,"U13 (dečki)"]
[]
[null,null,"Priimek in ime","Roj.skrita","BIB","Društvo, klub","1. ser","2. ser","3. ser","4. ser","1. ser","2. ser","skupno","nc*"]
[1,null,{"$f":"IF(E5=\"\",\"\",VLOOKUP(E5,'ePrijava in Navodila'!$B$13:$H$164,2,FALSE) & \" \" & VLOOKUP(E5,'ePrijava in Navodila'!$B$13:$H$164,3,FALSE))","v":""},{"$f":"IF(E5=\"\",\"\",VLOOKUP(E5,'ePrijava in Navodila'!$B$13:$H$164,5,FALSE))","v":""},null,{"$f":"IF(E5=\"\",\"\",VLOOKUP(E5,'ePrijava in Navodila'!$B$13:$H$164,7,FALSE))","v":""},null,null,null,null,null,null,{"$f":"SUM(G5:L5)","v":0},null,null,null,null,null,"EKIPNO: "]
[2,null,{"$f":"IF(E6=\"\",\"\",VLOOKUP(E6,'ePrijava in Navodila'!$B$13:$H$164,2,FALSE) & \" \" & VLOOKUP(E6,'ePrijava in Navodila'!$B$13:$H$164,3,FALSE))","v":""},{"$f":"IF(E6=\"\",\"\",VLOOKUP(E6,'ePrijava in Navodila'!$B$13:$H$164,5,FALSE))","v":""},null,{"$f":"IF(E6=\"\",\"\",VLOOKUP(E6,'ePrijava in Navodila'!$B$13:$H$164,7,FALSE))","v":""},null,null,null,null,null,null,0]
[3,null,{"$f":"IF(E7=\"\",\"\",VLOOKUP(E7,'ePrijava in Navodila'!$B$13:$H$164,2,FALSE) & \" \" & VLOOKUP(E7,'ePrijava in Navodila'!$B$13:$H$164,3,FALSE))","v":""},{"$f":"IF(E7=\"\",\"\",VLOOKUP(E7,'ePrijava in Navodila'!$B$13:$H$164,5,FALSE))","v":""},null,{"$f":"IF(E7=\"\",\"\",VLOOKUP(E7,'ePrijava in Navodila'!$B$13:$H$164,7,FALSE))","v":""},null,null,null,null,null,null,0,null,null,null,null,null,{"$f":"IF(R9=\"\",\"\",VLOOKUP(R9,'ePrijava in Navodila'!$B$13:$H$164,7,FALSE))","v":""}]
[4,null,{"$f":"IF(E8=\"\",\"\",VLOOKUP(E8,'ePrijava in Navodila'!$B$13:$H$164,2,FALSE) & \" \" & VLOOKUP(E8,'ePrijava in Navodila'!$B$13:$H$164,3,FALSE))","v":""},{"$f":"IF(E8=\"\",\"\",VLOOKUP(E8,'ePrijava in Navodila'!$B$13:$H$164,5,FALSE))","v":""},null,{"$f":"IF(E8=\"\",\"\",VLOOKUP(E8,'ePrijava in Navodila'!$B$13:$H$164,7,FALSE))","v":""},null,null,null,null,null,null,0,null,null,null,null,"BIB","Priimek in ime","1. ser","2. ser","3. ser","4. ser","1. ser","2. ser","skupno","nc*"]
{"$rows_left_out":142}
{"sheet":"U15","index":4,"n_rows":149,"n_cols":27,"rows_kept":149,"cut":false,"hidden":false,"merged":[[104,0,108,0],[104,1,108,1],[104,2,105,12],[0,2,0,12],[0,18,2,37],[1,0,3,0],[1,1,3,1],[1,2,1,12],[103,4,103,5]]}
[null,null,"POKAL PRIJATELJSTVA SERIJSKA ZRAČNA PUŠKA",null,null,null,null,null,null,null,null,null,null,null,null,null,null,null,"Iz evidence in zavihka ePrijava in Navodila se za tekmovalca v seznam za rezultate v stolpec E vpiše BIB številka pri \"moških\" od vrstice 5 dalje, za \"ženske\"pa od vrstice 110 dalje. Po vpisu BIB bo preneslo vse podatke v ta seznam, kjer se nato vpisujejo rezultati. Vpiše se rezultat serije v K in L  ter nc*. Prav tako se za upoštevanje rezultata ekipno vpišejo samo BIB številke v stolpcu R za vse tri člane ekipe, ki je lahko mešana. Prenos ostalih podatkov je samodejen.  Posamezno se lahko razvrsti, ekipno ostane nerazvrščeno. Dokument mora imeti omogočen makro."]
["mesto",null,"U15 (starejši dečki)"]
[]
[null,null,"Priimek in ime","Roj.skrita","BIB","Društvo, klub","1. ser","2. ser","3. ser","4. ser","1. ser","2. ser","skupno","nc*"]
[1,null,{"$f":"IF(E5=\"\",\"\",VLOOKUP(E5,'ePrijava in Navodila'!$B$13:$H$164,2,FALSE) & \" \" & VLOOKUP(E5,'ePrijava in Navodila'!$B$13:$H$164,3,FALSE))","v":""},{"$f":"IF(E5=\"\",\"\",VLOOKUP(E5,'ePrijava in Navodila'!$B$13:$H$164,5,FALSE))","v":""},null,{"$f":"IF(E5=\"\",\"\",VLOOKUP(E5,'ePrijava in Navodila'!$B$13:$H$164,7,FALSE))","v":""},null,null,null,null,null,null,{"$f":"SUM(G5:L5)","v":0},null,null,null,null,null,"EKIPNO: "]
[2,null,{"$f":"IF(E6=\"\",\"\",VLOOKUP(E6,'ePrijava in Navodila'!$B$13:$H$164,2,FALSE) & \" \" & VLOOKUP(E6,'ePrijava in Navodila'!$B$13:$H$164,3,FALSE))","v":""},{"$f":"IF(E6=\"\",\"\",VLOOKUP(E6,'ePrijava in Navodila'!$B$13:$H$164,5,FALSE))","v":""},null,{"$f":"IF(E6=\"\",\"\",VLOOKUP(E6,'ePrijava in Navodila'!$B$13:$H$164,7,FALSE))","v":""},null,null,null,null,null,null,0]
[3,null,{"$f":"IF(E7=\"\",\"\",VLOOKUP(E7,'ePrijava in Navodila'!$B$13:$H$164,2,FALSE) & \" \" & VLOOKUP(E7,'ePrijava in Navodila'!$B$13:$H$164,3,FALSE))","v":""},{"$f":"IF(E7=\"\",\"\",VLOOKUP(E7,'ePrijava in Navodila'!$B$13:$H$164,5,FALSE))","v":""},null,{"$f":"IF(E7=\"\",\"\",VLOOKUP(E7,'ePrijava in Navodila'!$B$13:$H$164,7,FALSE))","v":""},null,null,null,null,null,null,0,null,null,null,null,null,{"$f":"IF(R9=\"\",\"\",VLOOKUP(R9,'ePrijava in Navodila'!$B$13:$H$164,7,FALSE))","v":""}]
[4,null,{"$f":"IF(E8=\"\",\"\",VLOOKUP(E8,'ePrijava in Navodila'!$B$13:$H$164,2,FALSE) & \" \" & VLOOKUP(E8,'ePrijava in Navodila'!$B$13:$H$164,3,FALSE))","v":""},{"$f":"IF(E8=\"\",\"\",VLOOKUP(E8,'ePrijava in Navodila'!$B$13:$H$164,5,FALSE))","v":""},null,{"$f":"IF(E8=\"\",\"\",VLOOKUP(E8,'ePrijava in Navodila'!$B$13:$H$164,7,FALSE))","v":""},null,null,null,null,null,null,0,null,null,null,null,"BIB","Priimek in ime","1. ser","2. ser","3. ser","4. ser","1. ser","2. ser","skupno","nc*"]
{"$rows_left_out":142}
{"sheet":"U11-PI","index":5,"n_rows":149,"n_cols":27,"rows_kept":149,"cut":false,"hidden":false,"merged":[[104,0,108,0],[104,1,108,1],[104,2,105,12],[0,2,0,12],[0,18,2,37],[1,0,3,0],[1,1,3,1],[1,2,1,12],[103,4,103,5]]}
[null,null,"POKAL PRIJATELJSTVA ZRAČNA PIŠTOLA - NASLON",null,null,null,null,null,null,null,null,null,null,null,null,null,null,null,"Iz evidence in zavihka ePrijava in Navodila se za tekmovalca v seznam za rezultate v stolpec E vpiše BIB številka pri \"moških\" od vrstice 5 dalje, za \"ženske\"pa od vrstice 110 dalje. Po vpisu BIB bo preneslo vse podatke v ta seznam, kjer se nato vpisujejo rezultati. Vpiše se rezultat serije v K in L  ter nc*. Prav tako se za upoštevanje rezultata ekipno vpišejo samo BIB številke v stolpcu R za vse tri člane ekipe, ki je lahko mešana. Prenos ostalih podatkov je samodejen.  Posamezno se lahko razvrsti, ekipno ostane nerazvrščeno. Dokument mora imeti omogočen makro."]
["mesto",null,"U11 (mlajši dečki)"]
[]
[null,null,"Priimek in ime","Roj.skrita","BIB","Društvo, klub","1. ser","2. ser","3. ser","4. ser","1. ser","2. ser","skupno","nc*"]
[1,null,{"$f":"IF(E5=\"\",\"\",VLOOKUP(E5,'ePrijava in Navodila'!$B$13:$H$164,2,FALSE) & \" \" & VLOOKUP(E5,'ePrijava in Navodila'!$B$13:$H$164,3,FALSE))","v":""},{"$f":"IF(E5=\"\",\"\",VLOOKUP(E5,'ePrijava in Navodila'!$B$13:$H$164,5,FALSE))","v":""},null,{"$f":"IF(E5=\"\",\"\",VLOOKUP(E5,'ePrijava in Navodila'!$B$13:$H$164,7,FALSE))","v":""},null,null,null,null,null,null,{"$f":"SUM(G5:L5)","v":0},null,null,null,null,null,"EKIPNO: "]
[2,null,{"$f":"IF(E6=\"\",\"\",VLOOKUP(E6,'ePrijava in Navodila'!$B$13:$H$164,2,FALSE) & \" \" & VLOOKUP(E6,'ePrijava in Navodila'!$B$13:$H$164,3,FALSE))","v":""},{"$f":"IF(E6=\"\",\"\",VLOOKUP(E6,'ePrijava in Navodila'!$B$13:$H$164,5,FALSE))","v":""},null,{"$f":"IF(E6=\"\",\"\",VLOOKUP(E6,'ePrijava in Navodila'!$B$13:$H$164,7,FALSE))","v":""},null,null,null,null,null,null,0]
[3,null,{"$f":"IF(E7=\"\",\"\",VLOOKUP(E7,'ePrijava in Navodila'!$B$13:$H$164,2,FALSE) & \" \" & VLOOKUP(E7,'ePrijava in Navodila'!$B$13:$H$164,3,FALSE))","v":""},{"$f":"IF(E7=\"\",\"\",VLOOKUP(E7,'ePrijava in Navodila'!$B$13:$H$164,5,FALSE))","v":""},null,{"$f":"IF(E7=\"\",\"\",VLOOKUP(E7,'ePrijava in Navodila'!$B$13:$H$164,7,FALSE))","v":""},null,null,null,null,null,null,0,null,null,null,null,null,{"$f":"IF(R9=\"\",\"\",VLOOKUP(R9,'ePrijava in Navodila'!$B$13:$H$164,7,FALSE))","v":""}]
[4,null,{"$f":"IF(E8=\"\",\"\",VLOOKUP(E8,'ePrijava in Navodila'!$B$13:$H$164,2,FALSE) & \" \" & VLOOKUP(E8,'ePrijava in Navodila'!$B$13:$H$164,3,FALSE))","v":""},{"$f":"IF(E8=\"\",\"\",VLOOKUP(E8,'ePrijava in Navodila'!$B$13:$H$164,5,FALSE))","v":""},null,{"$f":"IF(E8=\"\",\"\",VLOOKUP(E8,'ePrijava in Navodila'!$B$13:$H$164,7,FALSE))","v":""},null,null,null,null,null,null,0,null,null,null,null,"BIB","Priimek in ime","1. ser","2. ser","3. ser","4. ser","1. ser","2. ser","skupno","nc*"]
{"$rows_left_out":142}
{"sheet":"U13-PI","index":6,"n_rows":149,"n_cols":27,"rows_kept":149,"cut":false,"hidden":false,"merged":[[104,0,108,0],[104,1,108,1],[104,2,105,12],[0,2,0,12],[0,18,2,37],[1,0,3,0],[1,1,3,1],[1,2,1,12],[103,4,103,5]]}
[null,null,"POKAL PRIJATELJSTVA ZRAČNA PIŠTOLA - NASLON",null,null,null,null,null,null,null,null,null,null,null,null,null,null,null,"Iz evidence in zavihka ePrijava in Navodila se za tekmovalca v seznam za rezultate v stolpec E vpiše BIB številka pri \"moških\" od vrstice 5 dalje, za \"ženske\"pa od vrstice 110 dalje. Po vpisu BIB bo preneslo vse podatke v ta seznam, kjer se nato vpisujejo rezultati. Vpiše se rezultat serije v K in L  ter nc*. Prav tako se za upoštevanje rezultata ekipno vpišejo samo BIB številke v stolpcu R za vse tri člane ekipe, ki je lahko mešana. Prenos ostalih podatkov je samodejen.  Posamezno se lahko razvrsti, ekipno ostane nerazvrščeno. Dokument mora imeti omogočen makro."]
["mesto",null,"U13 (dečki)"]
[]
[null,null,"Priimek in ime","Roj.skrita","BIB","Društvo, klub","1. ser","2. ser","3. ser","4. ser","1. ser","2. ser","skupno","nc*"]
[1,null,{"$f":"IF(E5=\"\",\"\",VLOOKUP(E5,'ePrijava in Navodila'!$B$13:$H$164,2,FALSE) & \" \" & VLOOKUP(E5,'ePrijava in Navodila'!$B$13:$H$164,3,FALSE))","v":""},{"$f":"IF(E5=\"\",\"\",VLOOKUP(E5,'ePrijava in Navodila'!$B$13:$H$164,5,FALSE))","v":""},null,{"$f":"IF(E5=\"\",\"\",VLOOKUP(E5,'ePrijava in Navodila'!$B$13:$H$164,7,FALSE))","v":""},null,null,null,null,null,null,{"$f":"SUM(G5:L5)","v":0},null,null,null,null,null,"EKIPNO: "]
[2,null,{"$f":"IF(E6=\"\",\"\",VLOOKUP(E6,'ePrijava in Navodila'!$B$13:$H$164,2,FALSE) & \" \" & VLOOKUP(E6,'ePrijava in Navodila'!$B$13:$H$164,3,FALSE))","v":""},{"$f":"IF(E6=\"\",\"\",VLOOKUP(E6,'ePrijava in Navodila'!$B$13:$H$164,5,FALSE))","v":""},null,{"$f":"IF(E6=\"\",\"\",VLOOKUP(E6,'ePrijava in Navodila'!$B$13:$H$164,7,FALSE))","v":""},null,null,null,null,null,null,0]
[3,null,{"$f":"IF(E7=\"\",\"\",VLOOKUP(E7,'ePrijava in Navodila'!$B$13:$H$164,2,FALSE) & \" \" & VLOOKUP(E7,'ePrijava in Navodila'!$B$13:$H$164,3,FALSE))","v":""},{"$f":"IF(E7=\"\",\"\",VLOOKUP(E7,'ePrijava in Navodila'!$B$13:$H$164,5,FALSE))","v":""},null,{"$f":"IF(E7=\"\",\"\",VLOOKUP(E7,'ePrijava in Navodila'!$B$13:$H$164,7,FALSE))","v":""},null,null,null,null,null,null,0,null,null,null,null,null,{"$f":"IF(R9=\"\",\"\",VLOOKUP(R9,'ePrijava in Navodila'!$B$13:$H$164,7,FALSE))","v":""}]
[4,null,{"$f":"IF(E8=\"\",\"\",VLOOKUP(E8,'ePrijava in Navodila'!$B$13:$H$164,2,FALSE) & \" \" & VLOOKUP(E8,'ePrijava in Navodila'!$B$13:$H$164,3,FALSE))","v":""},{"$f":"IF(E8=\"\",\"\",VLOOKUP(E8,'ePrijava in Navodila'!$B$13:$H$164,5,FALSE))","v":""},null,{"$f":"IF(E8=\"\",\"\",VLOOKUP(E8,'ePrijava in Navodila'!$B$13:$H$164,7,FALSE))","v":""},null,null,null,null,null,null,0,null,null,null,null,"BIB","Priimek in ime","1. ser","2. ser","3. ser","4. ser","1. ser","2. ser","skupno","nc*"]
{"$rows_left_out":142}
{"sheet":"Pravilnik","index":7,"n_rows":164,"n_cols":3,"rows_kept":164,"cut":false,"hidden":false,"merged":[[138,0,138,15],[12,0,12,15],[122,0,122,14],[126,0,126,13],[127,0,127,11],[129,0,129,12],[19,0,19,17],[24,0,24,17],[39,0,39,15],[58,0,58,15],[64,0,64,15],[69,0,69,14]]}
["Na podlagi 28. člena Statuta Strelske zveze Slovenije je Predsedstvo SZS na svoji 35. seji, dne"]
["05.  09. 2024, sprejelo"]
[]
[]
[]
["Pravilnik o tekmovanju za Pokal prijateljstva SZS"]
[]
[]
{"$rows_left_out":157}
{"sheet":"sodniki","index":8,"n_rows":288,"n_cols":1,"rows_kept":288,"cut":false,"hidden":true,"merged":[]}
["Stolpec1"]
["GOLOB Peter,  MS,  A 5779"]
["FERENČAK  Robert,  MS,  A 5156"]
["VALANT Elvira,  MS,   A 4199"]
["ADLEŠIČ Jernej,  MS,  B 8081"]
["FEVŽER Martin,  MS,  B 8062"]
["GOLOB Irena,  MS,  B 8086"]
["GÖNC Simeon,  MS,  B 8084"]
{"$rows_left_out":281}
{"sheet":"clanice","index":9,"n_rows":119,"n_cols":1,"rows_kept":119,"cut":false,"hidden":true,"merged":[]}
["Izberite iz seznama"]
["Strelsko društvo SLOVENSKE KONJICE, Slovenske Konjice"]
["Strelsko društvo DOLIČ, Mislinja"]
["Strelsko društvo LJUBO ŠERCER, Ljubljana"]
["Klub za praktično streljanje BURJA Bač, Pivka"]
["Strelski klub BREŽICE, Brežice"]
["Strelsko društvo JOŽETA MIHEVCA IDRIJA, Idrija"]
["Strelski klub IZOLA, Izola"]
{"$rows_left_out":111}